project,cell_specimen_id,cell_specimen_name,hemisphere,structure,donor_id,donor_name,biological_sex,age,ethnicity,medical_conditions,full_genotype,dendrite_type,apical_dendrite_status,neuron_reconstruction_type,cell_soma_normalized_depth,depth_from_pia_um,ephys_session_id,transcriptomics_sample_id,transcriptomics_batch,corresponding_AIT2.3.1_ID,corresponding_AIT2.3.1_alias
hIVSCC-MET,541549258,H16.03.007.01.01.05.07,left,MTG,H16.03.007,H16.03.007,F,28 yrs,White or Caucasian,epilepsy,,spiny,intact,full,0.165168855148479,558,541549227,RS1SS-161025-01_E12-50_S63,285-813,,Exc L2-3 LINC00507 FREM3
hIVSCC-MET,541557114,H16.03.007.01.01.05.10,left,MTG,H16.03.007,H16.03.007,F,28 yrs,White or Caucasian,epilepsy,,spiny,intact,dendrite-only,0.167381064561714,540,541557101,RS1SS-161025-01_E12-50_S66,285-813,,Exc L2 LAMP5 LTK
hIVSCC-MET,567754968,H17.06.003.11.07.04,left,MTG,H17.06.003,H17.06.003,F,23 yrs,,epilepsy,,spiny,truncated,,,825,567754895,huPSX170327_E1-50_S04,BT024,,Exc L2-3 LINC00507 FREM3
hIVSCC-MET,569835804,H17.03.002.11.09.04,right,MTG,H17.03.002,H17.03.002,M,61 yrs,unknown,epilepsy,,spiny,intact,dendrite-only,0.080998865444945,240,569835791,huPSX170327_E1-50_S15,BT024,,Exc L2 LAMP5 LTK
hIVSCC-MET,569860121,H17.03.002.11.11.05,right,MTG,H17.03.002,H17.03.002,M,61 yrs,unknown,epilepsy,,spiny,intact,dendrite-only,0.166927276298076,460,569860104,huPSX170327_E1-50_S22,BT024,,Exc L2 LAMP5 LTK
hIVSCC-MET,571511167,H17.06.005.12.17.01,left,MTG,H17.06.005,H17.06.005,M,38 yrs,,epilepsy,,spiny,NA,,,,571511135,huPSX170327_E1-50_S30,BT024,,Exc L2-3 LINC00507 FREM3
hIVSCC-MET,571640763,H17.06.006.11.04.03,left,MTG,H17.06.006,H17.06.006,M,35 yrs,,epilepsy,,spiny,intact,,,271,571640515,huPSX170327_E1-50_S39,BT024,,Exc L2 LAMP5 LTK
hIVSCC-MET,571732727,H17.06.006.11.04.11,left,MTG,H17.06.006,H17.06.006,M,35 yrs,,epilepsy,,spiny,intact,dendrite-only,0.299001923202734,918,571732666,huPSX170327_E1-50_S42,BT024,,Exc L2-3 LINC00507 FREM3
hIVSCC-MET,576110753,H17.06.007.11.04.01,right,MFG,H17.06.007,H17.06.007,F,42 yrs,White or Caucasian,tumor,,spiny,intact,dendrite-only,0.222283475018853,706,576110705,huPSX041217_E1-50_S01,BT025,,Exc L2-3 LINC00507 FREM3
hIVSCC-MET,576118161,H17.06.007.11.04.02,right,MFG,H17.06.007,H17.06.007,F,42 yrs,White or Caucasian,tumor,,spiny,intact,dendrite-only,0.0917607527137896,303,576118003,huPSX041217_E1-50_S02,BT025,,Exc L2-3 LINC00507 FREM3
hIVSCC-MET,576134298,H17.06.007.11.04.03,right,MFG,H17.06.007,H17.06.007,F,42 yrs,White or Caucasian,tumor,,spiny,intact,dendrite-only,0.28328362314824,882,576134053,huPSX041217_E1-50_S03,BT025,,Exc L3-4 RORB CARM1P1
hIVSCC-MET,576140393,H17.06.007.11.04.04,right,MFG,H17.06.007,H17.06.007,F,42 yrs,White or Caucasian,tumor,,spiny,intact,dendrite-only,0.301814020650488,932,576140380,huPSX041217_E1-50_S04,BT025,,Exc L3-4 RORB CARM1P1
hIVSCC-MET,591317875,H17.03.006.11.09.03,left,STG,H17.03.006,H17.03.006,F,67 yrs,,epilepsy,,spiny,NA,,,1209,591317862,PS061517_E1-50_S03,BT029,,Exc L2-3 LINC00507 FREM3
hIVSCC-MET,591337995,H17.03.006.11.09.05,left,STG,H17.03.006,H17.03.006,F,67 yrs,,epilepsy,,spiny,NA,,,,591337939,PS061517_E1-50_S05,BT029,,Exc L2-3 LINC00507 FREM3
hIVSCC-MET,591399440,H17.03.006.11.14.02,left,STG,H17.03.006,H17.03.006,F,67 yrs,,epilepsy,,spiny,notchecked,,,,591399423,PS061517_E1-50_S20,BT029,,Exc L3-5 RORB COL22A1
hIVSCC-MET,591411338,H17.03.006.11.08.02,left,STG,H17.03.006,H17.03.006,F,67 yrs,,epilepsy,,spiny,NA,,,,591411317,PS061517_E1-50_S36,BT029,,Exc L3-5 RORB COL22A1
hIVSCC-MET,591422059,H17.03.006.11.08.04,left,STG,H17.03.006,H17.03.006,F,67 yrs,,epilepsy,,spiny,NA,,,,591422046,PS061517_E1-50_S38,BT029,,Exc L2 LAMP5 LTK
hIVSCC-MET,591442366,H17.03.006.11.08.05,left,STG,H17.03.006,H17.03.006,F,67 yrs,,epilepsy,,spiny,NA,,,,591442353,PS061517_E1-50_S39,BT029,,Exc L2 LAMP5 LTK
hIVSCC-MET,592470583,H17.03.007.12.17.01,right,MTG,H17.03.007,H17.03.007,F,27 yrs,unknown,epilepsy,,spiny,NA,,,1217,592470570,PS061517_E1-50_S41,BT029,,Exc L3-5 RORB COL22A1
hIVSCC-MET,592518575,H17.03.007.12.07.02,right,MTG,H17.03.007,H17.03.007,F,27 yrs,unknown,epilepsy,,spiny,NA,,,1339,592518561,PS061517_E1-50_S58,BT029,,Exc L3-4 RORB CARM1P1
hIVSCC-MET,592532014,H17.03.007.12.07.03,right,MTG,H17.03.007,H17.03.007,F,27 yrs,unknown,epilepsy,,spiny,intact,dendrite-only,0.422476318148027,1551,592531937,PS061517_E1-50_S59,BT029,,Exc L3-5 RORB COL22A1
hIVSCC-MET,592536009,H17.03.007.12.07.04,right,MTG,H17.03.007,H17.03.007,F,27 yrs,unknown,epilepsy,,spiny,NA,,,1437,592535960,PS061517_E1-50_S60,BT029,,Exc L3-5 RORB COL22A1
hIVSCC-MET,592544683,H17.03.007.12.07.05,right,MTG,H17.03.007,H17.03.007,F,27 yrs,unknown,epilepsy,,spiny,NA,,,1302,592544658,PS061517_E1-50_S61,BT029,,Exc L3-4 RORB CARM1P1
hIVSCC-MET,592558182,H17.03.007.12.07.06,right,MTG,H17.03.007,H17.03.007,F,27 yrs,unknown,epilepsy,,spiny,NA,,,1186,592558145,PS061517_E1-50_S62,BT029,,Exc L3-4 RORB CARM1P1
hIVSCC-MET,592585119,H17.03.007.11.06.01,right,MTG,H17.03.007,H17.03.007,F,27 yrs,unknown,epilepsy,,spiny,NA,,,276,592585099,PS061517_E1-50_S63,BT029,,Exc L2-3 LINC00507 FREM3
hIVSCC-MET,592592260,H17.03.007.11.06.02,right,MTG,H17.03.007,H17.03.007,F,27 yrs,unknown,epilepsy,,spiny,NA,,,1128,592592047,PS061517_E1-50_S64,BT029,,Exc L2-3 LINC00507 FREM3
hIVSCC-MET,592598069,H17.03.007.11.06.03,right,MTG,H17.03.007,H17.03.007,F,27 yrs,unknown,epilepsy,,spiny,NA,,,1090,592598056,PS061517_E1-50_S65,BT029,,Exc L2 LAMP5 LTK
hIVSCC-MET,592598599,H17.03.007.11.06.04,right,MTG,H17.03.007,H17.03.007,F,27 yrs,unknown,epilepsy,,spiny,NA,,,1323,592598585,PS061517_E1-50_S66,BT029,,Exc L3-4 RORB CARM1P1
hIVSCC-MET,595572609,H17.03.008.11.06.04,right,MTG,H17.03.008,H17.03.008,F,60 yrs,White or Caucasian,epilepsy,,spiny,intact,full,0.337669776811293,891,595572593,BT170919-01_E1-50_S04,BT041,,Exc L2-3 LINC00507 FREM3
hIVSCC-MET,595583062,H17.03.008.11.06.06,right,MTG,H17.03.008,H17.03.008,F,60 yrs,White or Caucasian,epilepsy,,spiny,intact,full,0.125995104521318,298,595583049,BT170919-01_E1-50_S06,BT041,,Exc L2 LAMP5 LTK
hIVSCC-MET,596036401,H17.06.009.11.06.03,left,MTG,H17.06.009,H17.06.009,M,52 yrs,White or Caucasian,tumor,,spiny,NA,,,480,596036386,BT170919-01_E1-50_S23,BT041,,Exc L2-3 LINC00507 FREM3
hIVSCC-MET,596049425,H17.06.009.11.06.05,left,MTG,H17.06.009,H17.06.009,M,52 yrs,White or Caucasian,tumor,,spiny,truncated,,,1003,596049412,BT170919-01_E1-50_S25,BT041,,Exc L3-4 RORB CARM1P1
hIVSCC-MET,596052266,H17.06.009.11.06.06,left,MTG,H17.06.009,H17.06.009,M,52 yrs,White or Caucasian,tumor,,spiny,NA,,,439,596052253,BT170919-01_E1-50_S26,BT041,,Exc L2-3 LINC00507 FREM3
hIVSCC-MET,596053384,H17.06.009.11.06.07,left,MTG,H17.06.009,H17.06.009,M,52 yrs,White or Caucasian,tumor,,spiny,NA,,,423,596053349,BT170919-01_E1-50_S27,BT041,,Exc L2-3 LINC00507 FREM3
hIVSCC-MET,596069208,H17.06.009.11.06.09,left,MTG,H17.06.009,H17.06.009,M,52 yrs,White or Caucasian,tumor,,spiny,NA,,,417,596069195,BT170919-01_E1-50_S29,BT041,,Exc L2-3 LINC00507 FREM3
hIVSCC-MET,596891511,H17.03.009.11.06.04,right,MTG,H17.03.009,H17.03.009,M,18 yrs,unknown,epilepsy,,spiny,notchecked,,,,596891498,BT170919-01_E1-50_S38,BT041,,Exc L2-3 LINC00507 FREM3
hIVSCC-MET,596892878,H17.03.009.11.08.02,right,MTG,H17.03.009,H17.03.009,M,18 yrs,unknown,epilepsy,,spiny,NA,,,308,596892865,BT170919-01_E1-50_S44,BT041,,Exc L2 LAMP5 LTK
hIVSCC-MET,596894384,H17.03.009.11.06.06,right,MTG,H17.03.009,H17.03.009,M,18 yrs,unknown,epilepsy,,spiny,notchecked,,,,596894371,BT170919-01_E1-50_S40,BT041,,Exc L3-5 RORB COL22A1
hIVSCC-MET,596894444,H17.03.009.11.08.03,right,MTG,H17.03.009,H17.03.009,M,18 yrs,unknown,epilepsy,,spiny,intact,,,520,596894428,BT170919-01_E1-50_S45,BT041,,Exc L2-3 LINC00507 FREM3
hIVSCC-MET,596898838,H17.03.009.11.08.04,right,MTG,H17.03.009,H17.03.009,M,18 yrs,unknown,epilepsy,,spiny,intact,dendrite-only,0.114397107875749,363,596898822,BT170919-01_E1-50_S46,BT041,,Exc L2 LAMP5 LTK
hIVSCC-MET,596917084,H17.03.009.11.08.09,right,MTG,H17.03.009,H17.03.009,M,18 yrs,unknown,epilepsy,,spiny,notchecked,,0.127282555477261,438,596917071,BT170919-01_E1-50_S51,BT041,,Exc L2-3 LINC00507 FREM3
hIVSCC-MET,601940782,H17.03.010.12.19.02,left,MTG,H17.03.010,H17.03.010,F,38 yrs,unknown,epilepsy,,spiny,notchecked,,,570,601940724,BT170919-01_E1-50_S68,BT041,,Exc L2-3 LINC00507 FREM3
hIVSCC-MET,601958678,H17.03.010.11.09.06,left,MTG,H17.03.010,H17.03.010,F,38 yrs,unknown,epilepsy,,spiny,notchecked,,,644,601958627,BT170919-01_E1-50_S66,BT041,,Exc L2 LAMP5 LTK
hIVSCC-MET,602165685,H17.03.010.11.06.02,left,MTG,H17.03.010,H17.03.010,F,38 yrs,unknown,epilepsy,,spiny,intact,full,0.0854227695718923,291,602165643,BT170919-01_E1-50_S83,BT041,,Exc L2 LAMP5 LTK
hIVSCC-MET,602234640,H17.03.010.11.06.07,left,MTG,H17.03.010,H17.03.010,F,38 yrs,unknown,epilepsy,,spiny,truncated,,,1260,602234627,BT170919-01_E1-50_S88,BT041,,Exc L3-5 RORB COL22A1
hIVSCC-MET,611616275,H17.06.012.14.06.06,right,MTG,H17.06.012,H17.06.012,M,23 yrs,American Indian and Alaska Native,epilepsy,,spiny,notchecked,,,,611616224,BT170919-02_E1-50_S44,BT042,,Exc L2 LAMP5 LTK
hIVSCC-MET,611630983,H17.06.012.14.06.08,right,MTG,H17.06.012,H17.06.012,M,23 yrs,American Indian and Alaska Native,epilepsy,,spiny,notchecked,,,,611630962,BT170919-02_E1-50_S46,BT042,,Exc L2 LAMP5 LTK
hIVSCC-MET,611926705,H17.06.012.14.11.07,right,MTG,H17.06.012,H17.06.012,M,23 yrs,American Indian and Alaska Native,epilepsy,,spiny,notchecked,,,,611926417,BT170919-02_E1-50_S53,BT042,,Exc L2 LAMP5 LTK
hIVSCC-MET,642862180,H17.03.014.11.03.01,left,TemL,H17.03.014,H17.03.014,M,20 yrs,,epilepsy,,spiny,notchecked,,,1113,642862167,SM-GE652_S160_E1-50,RSC-127,,Exc L2 LAMP5 LTK
hIVSCC-MET,642864559,H17.03.014.11.04.02,left,TemL,H17.03.014,H17.03.014,M,20 yrs,,epilepsy,,spiny,notchecked,,,371,642864546,SM-GE652_S168_E1-50,RSC-127,,Exc L2 LAMP5 LTK
hIVSCC-MET,642867575,H17.03.014.11.09.04,left,TemL,H17.03.014,H17.03.014,M,20 yrs,,epilepsy,,spiny,truncated,,,1208,642867562,SM-GE652_S158_E1-50,RSC-127,,Exc L2-3 LINC00507 FREM3
hIVSCC-MET,650074936,H17.26.003.11.25.01,right,MTG,H17.26.003,H17.26.003,M,25 yrs,,tumor,,spiny,notchecked,,,,650074923,SM-GE65Y_S123_E1-50,RSC-135,,Exc L3-5 RORB COL22A1
hIVSCC-MET,652075403,H17.06.015.13.08.02,right,TemL,H17.06.015,H17.06.015,M,19 yrs,White or Caucasian,epilepsy,,spiny,NA,,,1135,652075387,SM-GE65O_S089_E1-50,RSC-136,,Exc L2-3 LINC00507 FREM3
hIVSCC-MET,653034602,H17.26.005.11.04.02,left,IFGtr,H17.26.005,H17.26.005,F,27 yrs,,tumor,,spiny,NA,,,,653034589,SM-GE8ZP_S166_E1-50,RSC-138,,Exc L2 LAMP5 LTK
hIVSCC-MET,653040833,H17.26.005.11.08.07,left,IFGtr,H17.26.005,H17.26.005,F,27 yrs,,tumor,,spiny,intact,full,0.475259381983093,1154,653040819,SM-GE8ZP_S162_E1-50,RSC-138,,Exc L3-5 RORB COL22A1
hIVSCC-MET,653804581,H17.03.016.11.04.01,right,MTG,H17.03.016,H17.03.016,M,36 yrs,,epilepsy,,spiny,intact,full,0.195602262136074,559,653804519,SM-GE672_S037_E1-50,RSC-139,,Exc L2 LAMP5 LTK
hIVSCC-MET,653825043,H17.03.016.11.04.03,right,MTG,H17.03.016,H17.03.016,M,36 yrs,,epilepsy,,spiny,NA,,,337,653824813,SM-GE672_S039_E1-50,RSC-139,,Exc L2 LAMP5 LTK
hIVSCC-MET,653825083,H17.03.016.11.03.03,right,MTG,H17.03.016,H17.03.016,M,36 yrs,,epilepsy,,spiny,NA,,,239,653825066,SM-GE672_S079_E1-50,RSC-139,,Exc L2 LAMP5 LTK
hIVSCC-MET,653854241,H17.03.016.11.04.04,right,MTG,H17.03.016,H17.03.016,M,36 yrs,,epilepsy,,spiny,intact,full,0.121565071896526,369,653854226,SM-GE672_S040_E1-50,RSC-139,,Exc L2 LAMP5 LTK
hIVSCC-MET,654180841,H17.03.016.11.09.03,right,MTG,H17.03.016,H17.03.016,M,36 yrs,,epilepsy,,spiny,intact,full,0.208468652189417,578,654180530,SM-GE672_S091_E1-50,RSC-139,,Exc L2 LAMP5 LTK
hIVSCC-MET,660494076,H18.06.001.11.11.04,left,SFG,H18.06.001,H18.06.001,M,69 yrs,White or Caucasian,tumor,,spiny,NA,,,1323,660494058,SM-GE67G_S107_E1-50,RSC-144,,Exc L3-5 RORB COL22A1
hIVSCC-MET,665694337,H18.03.003.11.11.01,right,,H18.03.003,H18.03.003,M,21 yrs,White or Caucasian,tumor,,spiny,notchecked,,,215,665694233,SM-GE91Q_S035_E1-50,RSC-146,,Exc L2-3 LINC00507 FREM3
hIVSCC-MET,665711442,H18.03.003.11.04.02,right,,H18.03.003,H18.03.003,M,21 yrs,White or Caucasian,tumor,,spiny,notchecked,,,284,665711421,SM-GE91Q_S021_E1-50,RSC-146,,Exc L2 LAMP5 LTK
hIVSCC-MET,665713811,H18.03.003.11.11.03,right,,H18.03.003,H18.03.003,M,21 yrs,White or Caucasian,tumor,,spiny,intact,full,0.132635288870251,296,665713792,SM-GE91Q_S037_E1-50,RSC-146,,Exc L2-3 LINC00507 FREM3
hIVSCC-MET,666155913,H18.03.003.12.01.03,right,,H18.03.003,H18.03.003,M,21 yrs,White or Caucasian,tumor,,spiny,truncated,,,,666155743,SM-GE91Q_S055_E1-50,RSC-146,,Exc L2-3 LINC00507 FREM3
hIVSCC-MET,672184275,H18.06.004.11.03.01,right,MTG,H18.06.004,H18.06.004,F,69 yrs,White or Caucasian,tumor,,spiny,notchecked,,,239,672184262,SM-GE8ZX_S147_E1-50,RSC-149,,Exc L2-3 LINC00507 FREM3
hIVSCC-MET,672299031,H18.06.004.11.02.02,right,MTG,H18.06.004,H18.06.004,F,69 yrs,White or Caucasian,tumor,,spiny,notchecked,,,407,672298648,SM-GE8ZX_S152_E1-50,RSC-149,,Exc L2 LAMP5 LTK
hIVSCC-MET,672646275,H18.03.004.11.13.01,left,ITG,H18.03.004,H18.03.004,M,28 yrs,,epilepsy,,spiny,notchecked,,,,672646262,SM-GE8ZX_S173_E1-50,RSC-149,,Exc L3-5 RORB COL22A1
hIVSCC-MET,672650722,H18.03.004.11.11.02,left,ITG,H18.03.004,H18.03.004,M,28 yrs,,epilepsy,,spiny,NA,,,498,672650708,SM-GE93P_S003_E1-50,RSC-150,,Exc L2-3 LINC00507 FREM3
hIVSCC-MET,674613931,H18.03.005.11.06.03,right,STG,H18.03.005,H18.03.005,F,49 yrs,White or Caucasian,epilepsy,,spiny,NA,,,177,674613868,SM-GE93S_S162_E1-50,RSC-150,,Exc L2 LAMP5 LTK
hIVSCC-MET,674615724,H18.03.005.11.09.03,right,STG,H18.03.005,H18.03.005,F,49 yrs,White or Caucasian,epilepsy,,spiny,NA,,,287,674615711,SM-GE93S_S126_E1-50,RSC-150,,Exc L2 LAMP5 LTK
hIVSCC-MET,674636128,H18.03.005.11.11.05,right,STG,H18.03.005,H18.03.005,F,49 yrs,White or Caucasian,epilepsy,,spiny,NA,,,270,674635802,SM-GE93S_S152_E1-50,RSC-150,,Exc L2-3 LINC00507 FREM3
hIVSCC-MET,674643161,H18.03.005.11.11.06,right,STG,H18.03.005,H18.03.005,F,49 yrs,White or Caucasian,epilepsy,,spiny,notchecked,,,920,674643148,SM-GE93S_S153_E1-50,RSC-150,,Exc L2-3 LINC00507 FREM3
hIVSCC-MET,674660116,H18.03.005.11.11.07,right,STG,H18.03.005,H18.03.005,F,49 yrs,White or Caucasian,epilepsy,,spiny,truncated,,,676,674660103,SM-GE93S_S154_E1-50,RSC-150,,Exc L2-3 LINC00507 FREM3
hIVSCC-MET,676464469,H18.06.005.11.06.01,left,MTG,H18.06.005,H18.06.005,F,56 yrs,White or Caucasian,tumor,,spiny,NA,,,,676464358,SM-GE93J_S003_E1-50,RSC-152,,Exc L2-3 LINC00507 FREM3
hIVSCC-MET,676983527,H18.03.006.11.04.01,left,SPL,H18.03.006,H18.03.006,F,24 yrs,,epilepsy,,spiny,NA,,,301,676983132,SM-GE93J_S025_E1-50,RSC-152,,Exc L2 LAMP5 LTK
hIVSCC-MET,676983694,H18.03.006.11.05.01,left,SPL,H18.03.006,H18.03.006,F,24 yrs,,epilepsy,,spiny,NA,,,231,676983606,SM-GE93J_S031_E1-50,RSC-152,,Exc L2-3 LINC00507 FREM3
hIVSCC-MET,677060360,H18.03.006.11.05.04,left,SPL,H18.03.006,H18.03.006,F,24 yrs,,epilepsy,,spiny,notchecked,,,212,677060197,SM-GE93J_S042_E1-50,RSC-152,,Exc L2 LAMP5 LTK
hIVSCC-MET,677060617,H18.03.006.11.02.01,left,SPL,H18.03.006,H18.03.006,F,24 yrs,,epilepsy,,spiny,NA,,,275,677060420,SM-GE93J_S020_E1-50,RSC-152,,Exc L2-3 LINC00507 FREM3
hIVSCC-MET,677088033,H18.03.006.11.05.05,left,SPL,H18.03.006,H18.03.006,F,24 yrs,,epilepsy,,spiny,intact,dendrite-only,0.243539794649028,605,677087840,SM-GE93J_S043_E1-50,RSC-152,,Exc L2-4 LINC00507 GLP2R
hIVSCC-MET,677094878,H18.03.006.11.02.02,left,SPL,H18.03.006,H18.03.006,F,24 yrs,,epilepsy,,spiny,NA,,,551,677094662,SM-GE93J_S021_E1-50,RSC-152,,Exc L2-3 LINC00507 FREM3
hIVSCC-MET,677099224,H18.03.006.11.04.05,left,SPL,H18.03.006,H18.03.006,F,24 yrs,,epilepsy,,spiny,notchecked,,,1069,677099014,SM-GE93J_S029_E1-50,RSC-152,,Exc L3-5 RORB COL22A1
hIVSCC-MET,680581022,H18.03.007.11.05.01,right,MTG,H18.03.007,H18.03.007,F,59 yrs,White or Caucasian,epilepsy,,spiny,notchecked,,,224,680581009,SM-GE93V_S001_E1-50,RSC-153,,Exc L2 LAMP5 LTK
hIVSCC-MET,680581271,H18.03.007.11.05.02,right,MTG,H18.03.007,H18.03.007,F,59 yrs,White or Caucasian,epilepsy,,spiny,notchecked,,,247,680581258,SM-GE93V_S002_E1-50,RSC-153,,Exc L2 LAMP5 LTK
hIVSCC-MET,680581533,H18.03.007.11.05.03,right,MTG,H18.03.007,H18.03.007,F,59 yrs,White or Caucasian,epilepsy,,spiny,notchecked,,,204,680581408,SM-GE93V_S003_E1-50,RSC-153,,Exc L2 LAMP5 LTK
hIVSCC-MET,685767564,H18.03.008.11.12.02,left,MTG,H18.03.008,H18.03.008,F,19 yrs,,epilepsy,,spiny,intact,full,0.143610581120044,410,685767550,SM-GE937_S182_E1-50,RSC-155,,Exc L2-3 LINC00507 FREM3
hIVSCC-MET,685806309,H18.03.008.11.14.05,left,MTG,H18.03.008,H18.03.008,F,19 yrs,,epilepsy,,spiny,intact,full,0.225927150601735,540,685806296,SM-GE93B_S027_E1-50,RSC-155,,Exc L2-3 LINC00507 FREM3
hIVSCC-MET,685814252,H18.03.008.11.12.08,left,MTG,H18.03.008,H18.03.008,F,19 yrs,,epilepsy,,spiny,intact,full,0.129714423301839,355,685814239,SM-GE937_S188_E1-50,RSC-155,,Exc L2 LAMP5 LTK
hIVSCC-MET,685815936,H18.03.008.11.14.07,left,MTG,H18.03.008,H18.03.008,F,19 yrs,,epilepsy,,spiny,intact,full,0.434094937180368,1136,685815923,SM-GE93B_S029_E1-50,RSC-155,,Exc L2-3 LINC00507 FREM3
hIVSCC-MET,686078633,H18.03.008.11.06.04,left,MTG,H18.03.008,H18.03.008,F,19 yrs,,epilepsy,,spiny,NA,,,,686077948,SM-GE937_S171_E1-50,RSC-155,,Exc L2-3 LINC00507 FREM3
hIVSCC-MET,689300528,H18.03.009.11.16.01,right,MTG,H18.03.009,H18.03.009,M,19 yrs,,epilepsy,,spiny,intact,full,0.139479539039857,333,689300515,SM-GE92Y_S018_E1-50,RSC-156,,Exc L2-3 LINC00507 FREM3
hIVSCC-MET,689306818,H18.03.009.11.14.02,right,MTG,H18.03.009,H18.03.009,M,19 yrs,,epilepsy,,spiny,intact,full,0.118087421579288,331,689306796,SM-GE92Y_S033_E1-50,RSC-156,,Exc L2-3 LINC00507 FREM3
hIVSCC-MET,689309060,H18.03.009.11.16.03,right,MTG,H18.03.009,H18.03.009,M,19 yrs,,epilepsy,,spiny,intact,full,0.189684510533648,479,689309047,SM-GE92Y_S020_E1-50,RSC-156,,Exc L2-3 LINC00507 FREM3
hIVSCC-MET,689312221,H18.03.009.11.16.04,right,MTG,H18.03.009,H18.03.009,M,19 yrs,,epilepsy,,spiny,intact,full,0.118123563769627,226,689312206,SM-GE92Y_S021_E1-50,RSC-156,,Exc L2-3 LINC00507 FREM3
hIVSCC-MET,689323433,H18.03.009.11.16.06,right,MTG,H18.03.009,H18.03.009,M,19 yrs,,epilepsy,,spiny,intact,full,0.168791474454661,404,689323420,SM-GE92Y_S023_E1-50,RSC-156,,Exc L2 LAMP5 LTK
hIVSCC-MET,689354518,H18.03.009.11.15.06,right,MTG,H18.03.009,H18.03.009,M,19 yrs,,epilepsy,,spiny,notchecked,,,964,689354505,SM-GE92Y_S007_E1-50,RSC-156,,Exc L3-4 RORB CARM1P1
hIVSCC-MET,689360253,H18.03.009.11.14.10,right,MTG,H18.03.009,H18.03.009,M,19 yrs,,epilepsy,,spiny,intact,full,0.109008282707777,280,689360240,SM-GE92Y_S041_E1-50,RSC-156,,Exc L2-4 LINC00507 GLP2R
hIVSCC-MET,689370040,H18.03.009.11.14.11,right,MTG,H18.03.009,H18.03.009,M,19 yrs,,epilepsy,,spiny,intact,full,0.342534685564191,1008,689369740,SM-GE92Y_S042_E1-50,RSC-156,,Exc L3-5 RORB COL22A1
hIVSCC-MET,695494556,H18.03.010.11.14.01,right,MTG,H18.03.010,H18.03.010,M,31 yrs,,epilepsy,,spiny,intact,full,0.128033117363504,365,695494540,SM-GE92K_S192_E1-50,RSC-157,,Exc L2-3 LINC00507 FREM3
hIVSCC-MET,695496425,H18.03.010.11.15.01,right,MTG,H18.03.010,H18.03.010,M,31 yrs,,epilepsy,,spiny,notchecked,,,418,695496410,SM-GE92K_S171_E1-50,RSC-157,,Exc L2-3 LINC00507 FREM3
hIVSCC-MET,695503873,H18.03.010.11.15.02,right,MTG,H18.03.010,H18.03.010,M,31 yrs,,epilepsy,,spiny,notchecked,,,771,695503853,SM-GE92K_S172_E1-50,RSC-157,,Exc L2-3 LINC00507 FREM3
hIVSCC-MET,695509869,H18.03.010.11.10.04,right,MTG,H18.03.010,H18.03.010,M,31 yrs,,epilepsy,,spiny,notchecked,,,1450,695509855,SM-GE92A_S018_E1-50,RSC-158,,Exc L2-3 LINC00507 FREM3
hIVSCC-MET,695510699,H18.03.010.11.15.03,right,MTG,H18.03.010,H18.03.010,M,31 yrs,,epilepsy,,spiny,notchecked,,,330,695510684,SM-GE92K_S173_E1-50,RSC-157,,Exc L2 LAMP5 LTK
hIVSCC-MET,695510727,H18.03.010.11.14.04,right,MTG,H18.03.010,H18.03.010,M,31 yrs,,epilepsy,,spiny,truncated,,,490,695510714,SM-GE92A_S003_E1-50,RSC-158,,Exc L2-3 LINC00507 FREM3
hIVSCC-MET,695517111,H18.03.010.11.15.04,right,MTG,H18.03.010,H18.03.010,M,31 yrs,,epilepsy,,spiny,notchecked,,,395,695517029,SM-GE92K_S174_E1-50,RSC-157,,Exc L2 LAMP5 LTK
hIVSCC-MET,695521538,H18.03.010.11.14.05,right,MTG,H18.03.010,H18.03.010,M,31 yrs,,epilepsy,,spiny,intact,full,0.0852786135838286,240,695521496,SM-GE92A_S004_E1-50,RSC-158,,Exc L2 LAMP5 LTK
hIVSCC-MET,695531200,H18.03.010.11.10.07,right,MTG,H18.03.010,H18.03.010,M,31 yrs,,epilepsy,,spiny,notchecked,,,412,695531184,SM-GE92A_S021_E1-50,RSC-158,,Exc L2-3 LINC00507 FREM3
hIVSCC-MET,695531231,H18.03.010.11.15.05,right,MTG,H18.03.010,H18.03.010,M,31 yrs,,epilepsy,,spiny,notchecked,,,316,695531218,SM-GE92K_S175_E1-50,RSC-157,,Exc L2 LAMP5 LTK
hIVSCC-MET,695538941,H18.03.010.11.10.08,right,MTG,H18.03.010,H18.03.010,M,31 yrs,,epilepsy,,spiny,notchecked,,,796,695538825,SM-GE92A_S022_E1-50,RSC-158,,Exc L2-4 LINC00507 GLP2R
hIVSCC-MET,695543474,H18.03.010.11.15.06,right,MTG,H18.03.010,H18.03.010,M,31 yrs,,epilepsy,,spiny,notchecked,,,505,695543419,SM-GE92K_S176_E1-50,RSC-157,,Exc L2 LAMP5 LTK
hIVSCC-MET,695546566,H18.03.010.11.14.07,right,MTG,H18.03.010,H18.03.010,M,31 yrs,,epilepsy,,spiny,intact,full,0.143250049253742,338,695546514,SM-GE92A_S006_E1-50,RSC-158,,Exc L2-3 LINC00507 FREM3
hIVSCC-MET,695557339,H18.03.010.11.14.08,right,MTG,H18.03.010,H18.03.010,M,31 yrs,,epilepsy,,spiny,intact,dendrite-only,0.118344566507991,323,695557325,SM-GE92A_S007_E1-50,RSC-158,,Exc L2-3 LINC00507 FREM3
hIVSCC-MET,695574435,H18.03.010.11.15.08,right,MTG,H18.03.010,H18.03.010,M,31 yrs,,epilepsy,,spiny,notchecked,,,808,695574422,SM-GE92K_S178_E1-50,RSC-157,,Exc L2-3 LINC00507 FREM3
hIVSCC-MET,696106680,H18.03.010.11.11.06,right,MTG,H18.03.010,H18.03.010,M,31 yrs,,epilepsy,,spiny,notchecked,,,1264,696106559,SM-GE92A_S045_E1-50,RSC-158,,Exc L2-3 LINC00507 FREM3
hIVSCC-MET,696109866,H18.03.010.11.11.08,right,MTG,H18.03.010,H18.03.010,M,31 yrs,,epilepsy,,spiny,notchecked,,,474,696109719,SM-GE92A_S047_E1-50,RSC-158,,Exc L2-3 LINC00507 FREM3
hIVSCC-MET,696111753,H18.03.010.11.11.09,right,MTG,H18.03.010,H18.03.010,M,31 yrs,,epilepsy,,spiny,notchecked,,,319,696111513,SM-GE92A_S048_E1-50,RSC-158,,Exc L2-3 LINC00507 FREM3
hIVSCC-MET,700798797,H18.03.012.11.07.02.01,right,PRG,H18.03.012,H18.03.012,M,22 yrs,,epilepsy,,spiny,notchecked,,,317,700798753,SM-GE8X7_S143_E1-50,RSC-159,,Exc L2 LAMP5 LTK
hIVSCC-MET,700821005,H18.03.012.11.07.02.03,right,PRG,H18.03.012,H18.03.012,M,22 yrs,,epilepsy,,spiny,notchecked,,,663,700820972,SM-GE8X7_S145_E1-50,RSC-159,,Exc L2-3 LINC00507 FREM3
hIVSCC-MET,700826482,H18.03.012.11.07.02.04,right,PRG,H18.03.012,H18.03.012,M,22 yrs,,epilepsy,,spiny,notchecked,,,1617,700826467,SM-GE8X7_S146_E1-50,RSC-159,,Exc L3-5 RORB COL22A1
hIVSCC-MET,700843573,H18.03.012.11.07.01.04,right,PRG,H18.03.012,H18.03.012,M,22 yrs,,epilepsy,,spiny,notchecked,,,600,700843431,SM-GE8X7_S173_E1-50,RSC-159,,Exc L2-3 LINC00507 FREM3
hIVSCC-MET,700862529,H18.03.012.11.13.02.07,right,PRG,H18.03.012,H18.03.012,M,22 yrs,,epilepsy,,spiny,notchecked,,,863,700862472,SM-GE8X7_S185_E1-50,RSC-159,,Exc L3-5 RORB COL22A1
hIVSCC-MET,701072592,H18.03.012.11.11.02.04,right,PRG,H18.03.012,H18.03.012,M,22 yrs,,epilepsy,,spiny,intact,full,0.422675242153699,1416,701072579,SM-GE8X7_S142_E1-50,RSC-159,,Exc L3-5 RORB COL22A1
hIVSCC-MET,707828926,H18.06.358.11.06.03,right,MFG,H18.06.358,H18.06.358,F,38 yrs,White or Caucasian,,,spiny,intact,dendrite-only,0.0901131385243812,261,707828821,SM-GE8WR_S069_E1-50,RSC-162,,Exc L2 LAMP5 LTK
hIVSCC-MET,707833551,H18.06.358.11.06.04,right,MFG,H18.06.358,H18.06.358,F,38 yrs,White or Caucasian,,,spiny,notchecked,,,913,707833431,SM-GE8WR_S070_E1-50,RSC-162,,Exc L3-4 RORB CARM1P1
hIVSCC-MET,712882769,H18.26.403.11.04.01.01,right,MFG,H18.26.403,H18.26.403,F,68 yrs,,tumor,,spiny,notchecked,,,202,712882756,SM-GE953_S090_E1-50,RSC-164,,Exc L2 LAMP5 LTK
hIVSCC-MET,712887031,H18.26.403.11.04.01.02,right,MFG,H18.26.403,H18.26.403,F,68 yrs,,tumor,,spiny,intact,dendrite-only,0.287316333823337,713,712886987,SM-GE953_S091_E1-50,RSC-164,,Exc L2-3 LINC00507 FREM3